Target
Thyroid hormone receptor alpha
Ligand
BDBM18873
Substrate
BDBM18860
Meas. Tech.
TRalpha-Binding Assay and Thyroid Response Element (TRAFalpha1) Reporter Assay.
pH
7±n/a
Temperature
277.15±n/a K
IC50
83±n/a nM
EC50
15±n/a nM
Citation
 Garg, NLi, YLGarcia Collazo, AMLitten, CRyono, DEZhang, MCaringal, YBrigance, RPMeng, WWashburn, WNAgback, PMellström, KRehnmark, SRahimi-Ghadim, MNorin, TGrynfarb, MSandberg, JGrover, GMalm, J Thyroid receptor ligands. Part 8: Thyromimetics derived from N-acylated-alpha-amino acid derivatives displaying modulated pharmacological selectivity compared with KB-141. Bioorg Med Chem Lett 17:4131-4 (2007)  
Target
Name:
Thyroid hormone receptor alpha
Synonyms:
C-erbA-alpha EAR7 NR1A1 THA_HUMAN THRA1 Thyroid Hormone Receptor (TR-alpha) Thyroid hormone receptor alpha c-erbA-1
Type:
Receptor
Mol. Mass.:
54818.00
Organism:
Homo sapiens (Human)
Description:
Recombinant hThR was obtained from nuclear extracts from SF9 cells infected with baculovirus vectors encoding for ThRalpha 1.
Residue:
490
  
Inhibitor
Name:
BDBM18873
Synonyms:
(2R)-2-(1-{3,5-dibromo-4-[4-hydroxy-3-(propan-2-yl)phenoxy]phenyl}acetamido)propanoic acid | N-acylated-alpha-amino acid derivative, 3c
Type:
Small organic molecule
Emp. Form.:
C20H21Br2NO5
Mol. Mass.:
515.192
SMILES:
CC(C)c1cc(Oc2c(Br)cc(CC(=O)N[C@H](C)C(O)=O)cc2Br)ccc1O
:
Substrate
Name:
BDBM18860
Synonyms:
(2R)-2-amino-3-[4-(4-hydroxy-3-iodophenoxy)-3,5-diiodophenyl]propanoic acid 3,5,3'-triiodo-L-thyronine (T3) Triiodothyronine US10544075, Compound T3 liothyronine | triothyrone
Type:
Hormone
Emp. Form.:
C15H12I3NO4
Mol. Mass.:
650.9735
SMILES:
N[C@@H](Cc1cc(I)c(Oc2ccc(O)c(I)c2)c(I)c1)C(O)=O
: