Target
Prothrombin
Ligand
BDBM19017
Substrate
BDBM13573
Meas. Tech.
Enzyme Assay and Determination of the Inhibition Constants.
Ki
>6300±n/a nM
Citation
 Pinto, DJOrwat, MJKoch, SRossi, KAAlexander, RSSmallwood, AWong, PCRendina, ARLuettgen, JMKnabb, RMHe, KXin, BWexler, RRLam, PY Discovery of 1-(4-Methoxyphenyl)-7-oxo-6-(4-(2-oxopiperidin-1-yl)phenyl)-4,5,6,7-tetrahydro- 1H-pyrazolo[3,4-c]pyridine-3-carboxamide (Apixaban, BMS-562247), a Highly Potent, Selective, Efficacious, and Orally Bioavailable Inhibitor of Blood Coagulation Factor Xa. J Med Chem 50:5339-56 (2007)  
Target
Name:
Prothrombin
Synonyms:
Activation peptide fragment 1 Coagulation factor II Prothrombin precursor Thrombin heavy chain | Thrombin light chain
Type:
Protein
Mol. Mass.:
70029.57
Organism:
Homo sapiens (Human)
Description:
P00734
Residue:
622
  
Inhibitor
Name:
BDBM19017
Synonyms:
N-{4-[1-(4-methoxyphenyl)-7-oxo-3-(trifluoromethyl)-1H,4H,5H,6H,7H-pyrazolo[3,4-c]pyridin-6-yl]phenyl}-N-methylacetamide | trifluoromethylpyrazole analogue, 36d
Type:
Small organic molecule
Emp. Form.:
C23H21F3N4O3
Mol. Mass.:
458.433
SMILES:
COc1ccc(cc1)-n1nc(c2CCN(C(=O)c12)c1ccc(cc1)N(C)C(C)=O)C(F)(F)F
:
Substrate
Name:
BDBM13573
Synonyms:
(2S)-5-carbamimidamido-N-(4-nitrophenyl)-2-{[(2S)-1-{[(2S)-5-oxopyrrolidin-2-yl]carbonyl}pyrrolidin-2-yl]formamido}pentanamide hydrochloride Glu-Pro-Arg-pNA L-Pyroglutamyl-L-prolyl-L-arginine-p-Nitroaniline S-2366
Type:
Small organic molecule
Emp. Form.:
C22H30N8O6
Mol. Mass.:
502.5236
SMILES:
[#7]\[#6](-[#7])=[#7]/[#6]-[#6]-[#6]-[#6@H](-[#7]-[#6](=O)-[#6@@H]-1-[#6]-[#6]-[#6]-[#7]-1-[#6](=O)-[#6@@H]-1-[#6]-[#6]-[#6](=O)-[#7]-1)-[#6](=O)-[#7]-c1ccc(cc1)-[#7+](-[#8-])=O
: