Target
Diacylglycerol O-acyltransferase 2
Ligand
BDBM360505
Substrate
Meas. Tech.
Enzymatic Activity Assay
IC50
602±n/a nM
Citation
 Imbriglio, JLondon, CLu, ZTata, JXiong, YYou, MYoum, H Isoquinoline derivatives useful as inhibitors of diacylglyceride O-acyltransferase 2 US Patent  US9828369 Publication Date 11/28/2017 
Target
Name:
Diacylglycerol O-acyltransferase 2
Synonyms:
ARAT DGAT2 Diacylglycerol O-acyltransferase 2 (DGAT2) Retinol O-fatty-acyltransferase
Type:
Multi-pass membrane protein
Mol. Mass.:
43848.90
Organism:
Homo sapiens (Human)
Description:
Q96PD7
Residue:
388
  
Inhibitor
Name:
BDBM360505
Synonyms:
N-((5-(3-methoxyphenyl)isoquinolin- 8-yl)methyl)-2-(3- (trifluoromethoxy)phenyl)acetamide | US9828369, Example 62
Type:
Small organic molecule
Emp. Form.:
C26H21F3N2O3
Mol. Mass.:
466.4517
SMILES:
COc1cccc(c1)-c1ccc(CNC(=O)Cc2cccc(OC(F)(F)F)c2)c2cnccc12
: