Target
Trace amine-associated receptor 1
Ligand
BDBM360627
Substrate
Meas. Tech.
Radioligand Binding Assay
Ki
19.2±n/a nM
Citation
 Cecere, GGalley, GNorcross, RPatiny-Adam, APflieger, P Substituted pyrazino[2,2-a]isoquinoline derivatives US Patent  US9828374 Publication Date 11/28/2017 
Target
Name:
Trace amine-associated receptor 1
Synonyms:
TAAR1_MOUSE Taar1 Trace amine receptor 1 (TARR1) Trace amine-associated receptor1 | Trar1
Type:
Protein
Mol. Mass.:
37635.41
Organism:
Mus musculus (Mouse)
Description:
Q923Y8
Residue:
332
  
Inhibitor
Name:
BDBM360627
Synonyms:
(11bR)-N-(5-cyclopropylpyrimidin-2-yl)-2,3,4,6,7,11b-hexahydro-1H-pyrazino[2,1-a]isoquinolin-9-amine | US9828374, Example 14
Type:
Small organic molecule
Emp. Form.:
C19H23N5
Mol. Mass.:
321.4194
SMILES:
C1CC1c1cnc(Nc2ccc3[C@@H]4CNCCN4CCc3c2)nc1
: