Target
Histone deacetylase 4
Ligand
BDBM19147
Substrate
[3H]acetyl-labeled histones
Meas. Tech.
In Vitro Enzyme Inhibition Assay
IC50
580±n/a nM
Citation
 Itoh, YSuzuki, TKouketsu, ASuzuki, NMaeda, SYoshida, MNakagawa, HMiyata, N Design, synthesis, structure-selectivity relationship, and effect on human cancer cells of a novel series of histone deacetylase 6-selective inhibitors. J Med Chem 50:5425-38 (2007)  
Target
Name:
Histone deacetylase 4
Synonyms:
Cereblon/Histone deacetylase 4 HDAC4 Histone acetylase 4(HDAC4) KIAA0288
Type:
Enzyme
Mol. Mass.:
119049.39
Organism:
Homo sapiens (Human)
Description:
P56524
Residue:
1084
  
Inhibitor
Name:
BDBM19147
Synonyms:
cyclohexyl N-[(1S)-1-(cyclopentylcarbamoyl)-6-sulfanylhexyl]carbamate | thiolate analogue, 38a
Type:
Small organic molecule
Emp. Form.:
C19H34N2O3S
Mol. Mass.:
370.55
SMILES:
SCCCCC[C@H](NC(=O)OC1CCCCC1)C(=O)NC1CCCC1
:
Substrate
Name:
[3H]acetyl-labeled histones
Synonyms:
Type:
Other Protein Type
Mol. Mass.:
358.43
Organism:
Bos taurus (bovine)
Description:
Residue:
3
NA