Target
Mitogen-activated protein kinase 1
Ligand
BDBM244161
Substrate
Meas. Tech.
Activated ERK2 Kinase Assay
pH
7.5±n/a
IC50
11.0±n/a nM
Comments
extracted
Citation
 Dillon, MPLindvall, MPoon, DRamurthy, SRauniyar, VShafer, CSubramanian, STanner, HR Substituted pyrrolo[3,4-d]pyrimidines as kinase inhibitors US Patent  US9546173 Publication Date 1/17/2017 
Target
Name:
Mitogen-activated protein kinase 1
Synonyms:
ERK2 Extracellular signal-regulated kinase 2 Extracellular signal-regulated kinase 2 (ERK2) MAPK 2 MK01_HUMAN Mitogen-activated protein kinase 1 (ERK-2) Mitogen-activated protein kinase 2 PRKM2 | p42-MAPK
Type:
Ser/Thr Protein Kinase
Mol. Mass.:
41392.76
Organism:
Homo sapiens (Human)
Description:
P28482
Residue:
360
  
Inhibitor
Name:
BDBM244161
Synonyms:
US9546173, cmpd 88 | n-(3-carbamoylbenzyl)-5,5-dimethyl-2-((tetrahydro-2h-pyran-4-yl)amino)-5h-pyrrolo[3,4-d]pyrimidine-6(7h)-carboxamide
Type:
Small organic molecule
Emp. Form.:
C22H28N6O3
Mol. Mass.:
424.4961
SMILES:
CC1(C)N(Cc2nc(NC3CCOCC3)ncc12)C(=O)NCc1cccc(c1)C(N)=O
: