Target
cAMP-specific 3',5'-cyclic phosphodiesterase 4D
Ligand
BDBM135814
Substrate
Meas. Tech.
Inhibition Assay
IC50
25000±n/a nM
Citation
 Mjalli, AMGaddam, BPolisetti, DRKostura, MJGuzel, M Tricyclic compounds as modulators of TNF-α synthesis and as PDE4 inhibitors US Patent  US9833457 Publication Date 12/5/2017 
Target
Name:
cAMP-specific 3',5'-cyclic phosphodiesterase 4D
Synonyms:
3',5'-cyclic phosphodiesterase PDE43 PDE4D_HUMAN | Phosphodiesterase 4D
Type:
Protein
Mol. Mass.:
91092.69
Organism:
Homo sapiens (Human)
Description:
Q08499
Residue:
809
  
Inhibitor
Name:
BDBM135814
Synonyms:
US10085990, Example 33 US8853226, 33 US9833457, 33
Type:
Small organic molecule
Emp. Form.:
C21H25N3O2
Mol. Mass.:
351.4421
SMILES:
CCn1c(=O)n(C2CCCC2)c2c3cccc(C(C)C)c3ncc2c1=O
: