Target
Kallikrein-1
Ligand
BDBM186956
Substrate
Meas. Tech.
Inhibition Assay
IC50
10000±n/a nM
Citation
 Allan, CEBatt, ARDavie, RLEdwards, HJEvans, DMPethen, SJ Benzylamine derivatives US Patent  US9834513 Publication Date 12/5/2017 
Target
Name:
Kallikrein-1
Synonyms:
KLK1 Kallikrein 1 Kidney/pancreas/salivary gland kallikrein | Tissue kallikrein
Type:
Enzyme
Mol. Mass.:
28874.69
Organism:
Homo sapiens (Human)
Description:
P06870
Residue:
262
  
Inhibitor
Name:
BDBM186956
Synonyms:
US9670157, 97 2,5-Dimethyl-1-[4-(4-methyl-pyrazol-1-ylmethyl)-benzyl]-1H-pyrrole-3-carboxylic acid 4-aminomethyl-2-methyl-benzylamide | US9834513, 97
Type:
Small organic molecule
Emp. Form.:
C28H33N5O
Mol. Mass.:
455.5945
SMILES:
Cc1cnn(Cc2ccc(Cn3c(C)cc(C(=O)NCc4ccc(CN)cc4C)c3C)cc2)c1
: