Target
Bromodomain-containing protein 4 [342-460]
Ligand
BDBM362653
Substrate
Meas. Tech.
AlphaScreen Assay
IC50
<25±n/a nM
Citation
 Combs, APSparks, RB Tricyclic heterocycles as bet protein inhibitors US Patent  US9834565 Publication Date 12/5/2017 
Target
Name:
Bromodomain-containing protein 4 [342-460]
Synonyms:
BRD4 BRD4_HUMAN Bromodomain-containing protein 4 (BRD4)(BD2) | HUNK1
Type:
Enzyme Catalytic Domain
Mol. Mass.:
13783.81
Organism:
Homo sapiens (Human)
Description:
a.a. 342-460 (BRD4-BD2)
Residue:
119
  
Inhibitor
Name:
BDBM362653
Synonyms:
(4S)-7-(3,5-dimethylisoxazol-4-yl)-2-[(3S)- 3-methyl-4-propionylpiperazin-1-yl]-4- pyridin-2-yl-4,5-dihydroimidazo[1,5,4- de][1,4]benzoxazine US9834565, Example 8
Type:
Small organic molecule
Emp. Form.:
C27H30N6O3
Mol. Mass.:
486.5655
SMILES:
CCC(=O)N1CCN(C[C@@H]1C)c1nc2ccc(-c3c(C)noc3C)c3OC[C@H](c4ccccn4)n1c23
: