Target
Cathepsin S
Ligand
BDBM19715
Substrate
BDBM19546
Meas. Tech.
Enzyme Inhibition Assay
pH
5.5±n/a
Temperature
310.15±n/a K
Ki
11±n/a nM
Citation
 Tully, DCLiu, HChatterjee, AKAlper, PBEpple, RWilliams, JARoberts, MJWoodmansee, DHMasick, BTTumanut, CLi, JSpraggon, GHornsby, MChang, JTuntland, THollenbeck, TGordon, PHarris, JLKaranewsky, DS Synthesis and SAR of arylaminoethyl amides as noncovalent inhibitors of cathepsin S: P3 cyclic ethers. Bioorg Med Chem Lett 16:5112-7 (2006)  
Target
Name:
Cathepsin S
Synonyms:
CATS_HUMAN Cathepsin S (Cat S) | cathepsin S preproprotein
Type:
Protein
Mol. Mass.:
37507.38
Organism:
Homo sapiens (Human)
Description:
P25774
Residue:
331
  
Inhibitor
Name:
BDBM19715
Synonyms:
(2S)-3-cyclohexyl-2-(morpholin-4-ylcarbonylamino)-N-[(2S)-1-{[4-(trifluoromethoxy)phenyl]amino}butan-2-yl]propanamide | arylaminoethyl amide deriv. 29
Type:
Small organic molecule
Emp. Form.:
C25H37F3N4O4
Mol. Mass.:
514.5809
SMILES:
CC[C@@H](CNc1ccc(OC(F)(F)F)cc1)NC(=O)[C@H](CC1CCCCC1)NC(=O)N1CCOCC1
:
Substrate
Name:
BDBM19546
Synonyms:
7-amino-3-carbamoylmethyl-4-methyl coumarin labeled fluorescent peptide | Ac-His-Pro-Val-Lys-ACMC
Type:
Emp. Form.:
Mol. Mass.:
SMILES:
: