Target
Cathepsin K
Ligand
BDBM19750
Substrate
BDBM19485
Meas. Tech.
Enzyme Inhibition Assay
IC50
>1000±n/a nM
Citation
 Altmann, EAichholz, RBetschart, CBuhl, TGreen, JIrie, OTeno, NLattmann, RTintelnot-Blomley, MMissbach, M 2-Cyano-pyrimidines: a new chemotype for inhibitors of the cysteine protease cathepsin K. J Med Chem 50:591-4 (2007)  
Target
Name:
Cathepsin K
Synonyms:
CATK_HUMAN CTSO Cathepsin O Cathepsin X
Type:
Enzyme
Mol. Mass.:
36975.68
Organism:
Homo sapiens (Human)
Description:
P43235
Residue:
329
  
Inhibitor
Name:
BDBM19750
Synonyms:
2-Cyano-pyrazine, 10 | 6-(cyclohexylamino)pyrazine-2-carbonitrile
Type:
Small organic molecule
Emp. Form.:
C11H14N4
Mol. Mass.:
202.2557
SMILES:
N#Cc1cncc(NC2CCCCC2)n1
:
Substrate
Name:
BDBM19485
Synonyms:
Cbz-Phe-Arg-AMC Z-Phe-Arg-AMC.HCl
Type:
Emp. Form.:
Mol. Mass.:
SMILES:
: