Target
Sodium channel protein type 9 subunit alpha
Ligand
BDBM258244
Substrate
Meas. Tech.
Electrophysiological Assay
IC50
17.0±n/a nM
Citation
 Shinozuka, TKobayashi, HSuzuki, STanaka, KKimoto, HDomon, Y Cycloalkane derivatives US Patent  US9845313 Publication Date 12/19/2017 
Target
Name:
Sodium channel protein type 9 subunit alpha
Synonyms:
NENA Peripheral sodium channel 1 SCN9A_HUMAN Voltage-gated sodium channel subunit Nav1.7 hNE-Na
Type:
Protein
Mol. Mass.:
226375.97
Organism:
Homo sapiens (Human)
Description:
Q15858
Residue:
1988
  
Inhibitor
Name:
BDBM258244
Synonyms:
US9493448, 152 US9845313, Example 152
Type:
Small organic molecule
Emp. Form.:
C19H17ClF3N5O3S
Mol. Mass.:
487.883
SMILES:
Fc1cc(O[C@H]2CC(F)(F)CC[C@@H]2c2cn[nH]c2)c(Cl)cc1S(=O)(=O)Nc1ccncn1
: