Target
Orexin receptor type 2
Ligand
BDBM143742
Substrate
Meas. Tech.
Receptor Radioligand Binding Assay
Ki
4700±n/a nM
Citation
 Gelin, CFLebold, TPShireman, BT Substituted 2-azabicycles and their use as orexin receptor modulators US Patent  US9845333 Publication Date 12/19/2017 
Target
Name:
Orexin receptor type 2
Synonyms:
Hcrtr2 OX2R_RAT Orexin receptor type 2 (OX2) Ox-2-R Ox2R
Type:
Protein
Mol. Mass.:
52508.46
Organism:
Rattus norvegicus (Rat)
Description:
P56719
Residue:
460
  
Inhibitor
Name:
BDBM143742
Synonyms:
US10183953, Example 1 US9611277, Example 1 | US9845333, 1
Type:
Small organic molecule
Emp. Form.:
C20H17F3N6O2
Mol. Mass.:
430.3832
SMILES:
FC(F)(F)c1cnc(OC2CC3CC2N(C3)C(=O)c2ccccc2-n2nccn2)cn1
: