Target
Orexin receptor type 2
Ligand
BDBM143790
Substrate
Meas. Tech.
Receptor Radioligand Binding Assay
Ki
676±n/a nM
Citation
 Gelin, CFLebold, TPShireman, BT Substituted 2-azabicycles and their use as orexin receptor modulators US Patent  US9845333 Publication Date 12/19/2017 
Target
Name:
Orexin receptor type 2
Synonyms:
Hcrtr2 OX2R_RAT Orexin receptor type 2 (OX2) Ox-2-R Ox2R
Type:
Protein
Mol. Mass.:
52508.46
Organism:
Rattus norvegicus (Rat)
Description:
P56719
Residue:
460
  
Inhibitor
Name:
BDBM143790
Synonyms:
US10183953, Example 51 US9611277, Example 51 | US9845333, 51
Type:
Small organic molecule
Emp. Form.:
C21H18F3N5O2
Mol. Mass.:
429.3951
SMILES:
FC(F)(F)c1cccnc1OC1CC2CC1N(C2)C(=O)c1ccccc1-n1nccn1
: