Target
Ectonucleotide pyrophosphatase/phosphodiesterase family member 2
Ligand
BDBM362947
Substrate
Meas. Tech.
Inhibition Assay
IC50
<500±n/a nM
Citation
 Hutchinson, JHLonergan, DHuang, FRowbottom, MCalderon, I Autotaxin inhibitor compounds US Patent  US9850203 Publication Date 12/26/2017 
Target
Name:
Ectonucleotide pyrophosphatase/phosphodiesterase family member 2
Synonyms:
ATX Autotaxin (ATX) ENPP2 Ectonucleotide Pyrophosphatase/Phosphodiesterase 2 (ENPP2) Extracellular lysophospholipase D PDNP2
Type:
Enzyme
Mol. Mass.:
99007.13
Organism:
Homo sapiens (Human)
Description:
Q13822
Residue:
863
  
Inhibitor
Name:
BDBM362947
Synonyms:
3-((6-Chloro-7-fluoro-1-(2-(indolin-1-yl)-2-oxoethyl)-2-methyl-1H-indol-3-yl)thio)benzoic acid | US9850203, Compound 1-14
Type:
Small organic molecule
Emp. Form.:
C28H24ClFN2O3S
Mol. Mass.:
523.018
SMILES:
CCOC(=O)c1cccc(Sc2c(C)n(CC(=O)N3CCc4ccccc34)c3c(F)c(Cl)ccc23)c1
: