Target
cAMP and cAMP-inhibited cGMP 3',5'-cyclic phosphodiesterase 10A
Ligand
BDBM363842
Substrate
Meas. Tech.
Enzymatic Assay
IC50
350±n/a nM
Citation
 Geneste, HOchse, MDrescher, KDinges, JJakob, C Inhibitor compounds of phosphodiesterase type 10A US Patent  US9856220 Publication Date 1/2/2018 
Target
Name:
cAMP and cAMP-inhibited cGMP 3',5'-cyclic phosphodiesterase 10A
Synonyms:
3',5'-cyclic phosphodiesterase PDE10A Phosphodiesterase 10 (PDE10) | Phosphodiesterase 10A
Type:
Protein
Mol. Mass.:
88412.52
Organism:
Homo sapiens (Human)
Description:
Q9Y233
Residue:
1055
  
Inhibitor
Name:
BDBM363842
Synonyms:
N-((2,5-dimethylthiophen-3-yl)methyl)-6,7-dimethoxy-1-oxo-2-(pentan-3-yl)-1,2-dihydroisoquinoline-4-carboxamide | US9856220, Example 242
Type:
Small organic molecule
Emp. Form.:
C24H30N2O4S
Mol. Mass.:
442.571
SMILES:
CCC(CC)n1cc(C(=O)NCc2cc(C)sc2C)c2cc(OC)c(OC)cc2c1=O
: