Target
Estrogen receptor
Ligand
BDBM19912
Substrate
BDBM17289
Meas. Tech.
Competition-Based Ligand Binding Assay and Transactivation Assay.
pH
8±n/a
Temperature
295.15±n/a K
IC50
4382±n/a nM
EC50
5305±n/a nM
Citation
 Güngör, TChen, YGolla, RMa, ZCorte, JRNorthrop, JPBin, BDickson, JKStouch, TZhou, RJohnson, SESeethala, RFeyen, JH Synthesis and characterization of 3-arylquinazolinone and 3-arylquinazolinethione derivatives as selective estrogen receptor beta modulators. J Med Chem 49:2440-55 (2006)  
Target
Name:
Estrogen receptor
Synonyms:
ER ESR ESR1_HUMAN Estrogen receptor Estrogen receptor (ER-alpha) Estrogen receptor alpha (ER) Nuclear receptor subfamily 3 group A member 1
Type:
Protein
Mol. Mass.:
66230.44
Organism:
Homo sapiens (Human)
Description:
P03372
Residue:
595
  
Inhibitor
Name:
BDBM19912
Synonyms:
3-arylquinazolinone, 1ac | 5,7-dihydroxy-3-(4-hydroxy-2-methylphenyl)-3,4-dihydroquinazolin-4-one
Type:
Small organic molecule
Emp. Form.:
C15H12N2O4
Mol. Mass.:
284.2668
SMILES:
Cc1cc(O)ccc1-n1cnc2cc(O)cc(O)c2c1=O
:
Substrate
Name:
BDBM17289
Synonyms:
(1S,10R,11S,15S)-5-hydroxy-15-methyltetracyclo[8.7.0.0^{2,7}.0^{11,15}]heptadeca-2,4,6-trien-14-one Estrone Estrone, 15 Kestrone Unigen [2,4,6,7-3H]-Estrone | folliculin
Type:
Steroid
Emp. Form.:
C18H22O2
Mol. Mass.:
270.3661
SMILES:
[H][C@@]12CCC(=O)[C@@]1(C)CC[C@]1([H])c3ccc(O)cc3CC[C@@]21[H]
: