Target
Estrogen receptor beta
Ligand
BDBM19911
Substrate
BDBM17289
Meas. Tech.
Competition-Based Ligand Binding Assay and Transactivation Assay.
IC50
9525±n/a nM
Citation
 Güngör, TChen, YGolla, RMa, ZCorte, JRNorthrop, JPBin, BDickson, JKStouch, TZhou, RJohnson, SESeethala, RFeyen, JH Synthesis and characterization of 3-arylquinazolinone and 3-arylquinazolinethione derivatives as selective estrogen receptor beta modulators. J Med Chem 49:2440-55 (2006)  
Target
Name:
Estrogen receptor beta
Synonyms:
ER-beta ESR2_HUMAN Estradiol receptor beta (ERβ) Estrogen receptor (ER beta) Estrogen receptor beta (ER beta) NR3A2 estrogen beta
Type:
Protein
Mol. Mass.:
59238.43
Organism:
Homo sapiens (Human)
Description:
Q92731
Residue:
530
  
Inhibitor
Name:
BDBM19911
Synonyms:
3-arylquinazolinone, 1ab | 5-hydroxy-3-(4-hydroxyphenyl)-7-methoxy-3,4-dihydroquinazolin-4-one
Type:
Small organic molecule
Emp. Form.:
C15H12N2O4
Mol. Mass.:
284.2668
SMILES:
COc1cc(O)c2c(c1)ncn(-c1ccc(O)cc1)c2=O
:
Substrate
Name:
BDBM17289
Synonyms:
(1S,10R,11S,15S)-5-hydroxy-15-methyltetracyclo[8.7.0.0^{2,7}.0^{11,15}]heptadeca-2,4,6-trien-14-one Estrone Estrone, 15 Kestrone Unigen [2,4,6,7-3H]-Estrone | folliculin
Type:
Steroid
Emp. Form.:
C18H22O2
Mol. Mass.:
270.3661
SMILES:
[H][C@@]12CCC(=O)[C@@]1(C)CC[C@]1([H])c3ccc(O)cc3CC[C@@]21[H]
: