Target
Solute carrier family 22 member 12
Ligand
BDBM363927
Substrate
Meas. Tech.
Bioactivity Assay
IC50
>1000±n/a nM
Citation
 Jiang, Y Carboxylic acid compound, method for preparation thereof, and use thereof US Patent  US9856239 Publication Date 1/2/2018 
Target
Name:
Solute carrier family 22 member 12
Synonyms:
OATL4 RST S22AC_HUMAN Solute carrier family 22 member 12 URAT1 Urate anion exchanger 1 (URAT1) | Uric Acid Transporter 1 (URAT1)
Type:
Enzyme
Mol. Mass.:
59638.65
Organism:
Homo sapiens (Human)
Description:
Q96S37
Residue:
553
  
Inhibitor
Name:
BDBM363927
Synonyms:
US9856239, 38
Type:
Small organic molecule
Emp. Form.:
C17H15N3O2S
Mol. Mass.:
325.385
SMILES:
OC(=O)CC1(CSc2ccncc2-c2ccc(cn2)C#N)CC1
: