Target
cAMP and cAMP-inhibited cGMP 3',5'-cyclic phosphodiesterase 10A
Ligand
BDBM364294
Substrate
Meas. Tech.
In Vitro Pharmacology Assay
IC50
>500±n/a nM
Citation
 Campbell, JEJones, PHewitt, MC Substituted pyrazolo[1,5-a]pyridines as PDE-10 inhibitors US Patent  US9856274 Publication Date 1/2/2018 
Target
Name:
cAMP and cAMP-inhibited cGMP 3',5'-cyclic phosphodiesterase 10A
Synonyms:
3',5'-cyclic phosphodiesterase PDE10A Phosphodiesterase 10 (PDE10) | Phosphodiesterase 10A
Type:
Protein
Mol. Mass.:
88412.52
Organism:
Homo sapiens (Human)
Description:
Q9Y233
Residue:
1055
  
Inhibitor
Name:
BDBM364294
Synonyms:
US10570156, Compound 2 | US9856274, Compound 2
Type:
Small organic molecule
Emp. Form.:
C16H18N8
Mol. Mass.:
322.3677
SMILES:
Cc1cnc(C)c2nc(CCc3nc4c(C)ncc(C)n4n3)nn12
: