Target
cAMP and cAMP-inhibited cGMP 3',5'-cyclic phosphodiesterase 10A
Ligand
BDBM364328
Substrate
Meas. Tech.
In Vitro Pharmacology Assay
IC50
55±n/a nM
Citation
 Campbell, JEJones, PHewitt, MC Substituted pyrazolo[1,5-a]pyridines as PDE-10 inhibitors US Patent  US9856274 Publication Date 1/2/2018 
Target
Name:
cAMP and cAMP-inhibited cGMP 3',5'-cyclic phosphodiesterase 10A
Synonyms:
3',5'-cyclic phosphodiesterase PDE10A Phosphodiesterase 10 (PDE10) | Phosphodiesterase 10A
Type:
Protein
Mol. Mass.:
88412.52
Organism:
Homo sapiens (Human)
Description:
Q9Y233
Residue:
1055
  
Inhibitor
Name:
BDBM364328
Synonyms:
US10570156, Compound 10 | US9856274, Compound 10
Type:
Small organic molecule
Emp. Form.:
C20H19N7
Mol. Mass.:
357.4118
SMILES:
Cc1cnc(C)n2nc(CCc3nc4c(ccc5ncccc45)n3C)nc12
: