Target
cAMP and cAMP-inhibited cGMP 3',5'-cyclic phosphodiesterase 10A
Ligand
BDBM364358
Substrate
Meas. Tech.
In Vitro Pharmacology Assay
IC50
<10±n/a nM
Citation
 Campbell, JEJones, PHewitt, MC Substituted pyrazolo[1,5-a]pyridines as PDE-10 inhibitors US Patent  US9856274 Publication Date 1/2/2018 
Target
Name:
cAMP and cAMP-inhibited cGMP 3',5'-cyclic phosphodiesterase 10A
Synonyms:
3',5'-cyclic phosphodiesterase PDE10A Phosphodiesterase 10 (PDE10) | Phosphodiesterase 10A
Type:
Protein
Mol. Mass.:
88412.52
Organism:
Homo sapiens (Human)
Description:
Q9Y233
Residue:
1055
  
Inhibitor
Name:
BDBM364358
Synonyms:
US10570156, Compound 40 | US9856274, Compound 40
Type:
Small organic molecule
Emp. Form.:
C20H17FN6
Mol. Mass.:
360.3876
SMILES:
Cc1c(CCc2nc3c(F)ccc(C)n3n2)nc2c3cccnc3ccn12
: