Target
P2X purinoceptor 7
Ligand
BDBM160078
Substrate
Meas. Tech.
P2X7 Radioligand Binding
Ki
6.30±n/a nM
Citation
 Ameriks, MKRech, JCSavall, BMWall, JL Substituted [1,2,4]triazolo[4,3-a]pyrazines as P2X7 modulators US Patent  US10053463 Publication Date 8/21/2018 
Target
Name:
P2X purinoceptor 7
Synonyms:
P2RX7_MOUSE P2x7
Type:
PROTEIN
Mol. Mass.:
68405.16
Organism:
Mus musculus
Description:
ChEMBL_1473824
Residue:
595
  
Inhibitor
Name:
BDBM160078
Synonyms:
US10047092, 19 US9040534, 19
Type:
Small organic molecule
Emp. Form.:
C19H16ClF3N6O
Mol. Mass.:
436.818
SMILES:
C[C@H]1Cn2c(nnc2-c2cnc(C)cn2)C(=O)N1Cc1cccc(c1Cl)C(F)(F)F
: