Target
P2X purinoceptor 7
Ligand
BDBM160120
Substrate
Meas. Tech.
P2X7 FLIPR Assay
pH
7.4±n/a
IC50
4.00±n/a nM
Comments
extracted
Citation
 Ameriks, MKRech, JCSavall, BMWall, JL Substituted [1,2,4]triazolo[4,3-a]pyrazines as P2X7 modulators US Patent  US10053463 Publication Date 8/21/2018 
Target
Name:
P2X purinoceptor 7
Synonyms:
ATP receptor P2RX7_HUMAN P2X purinoceptor 7 (P2X7) P2Z receptor | Purinergic receptor
Type:
Protein
Mol. Mass.:
68602.85
Organism:
Homo sapiens (Human)
Description:
Q99572
Residue:
595
  
Inhibitor
Name:
BDBM160120
Synonyms:
US10047092, 61 US9040534, 61
Type:
Small organic molecule
Emp. Form.:
C20H16ClF3N6O
Mol. Mass.:
448.829
SMILES:
FC(F)(F)c1cccc(CN2C(Cn3c(nnc3-c3cnccn3)C2=O)C2CC2)c1Cl
: