Target
Mitogen-activated protein kinase kinase kinase 12
Ligand
BDBM365261
Substrate
Meas. Tech.
TR-FRET assay
Ki
7.69±n/a nM
Citation
 Cohen, FPatel, S C-linked heterocycloaklyl substituted pyrimidines and their uses US Patent  US9868720 Publication Date 1/16/2018 
Target
Name:
Mitogen-activated protein kinase kinase kinase 12
Synonyms:
DLK Leucine-zipper protein kinase MAP3K12 MUK Mixed lineage kinase | ZPK
Type:
PROTEIN
Mol. Mass.:
93216.56
Organism:
Homo sapiens (Human)
Description:
ChEMBL_1460553
Residue:
859
  
Inhibitor
Name:
BDBM365261
Synonyms:
2-Imidazol-1-yl-1-{3-[2- (2-methyl-pyrrolidin-1- yl)-6-(4-trifluoromethyl- pyridin-2-ylamino)- pyrimidin-4-yl]-pyrrolidin- 1-yl}-ethanone US9868720, No. 402
Type:
Small organic molecule
Emp. Form.:
C24H27F3N8O
Mol. Mass.:
500.5194
SMILES:
CC1CCCN1c1nc(Nc2cc(ccn2)C(F)(F)F)cc(n1)C1CCN(C1)C(=O)Cn1ccnc1
: