Target
Heat shock protein HSP 90-beta
Ligand
BDBM20770
Substrate
BDBM10852
Meas. Tech.
Her-2 Degradation Assay
pH
7.2±n/a
Temperature
310.15±n/a K
EC50
130±n/a nM
Comments
EC50=240 nM in MTS cell-growth inhibition assay.
Citation
 Zhang, LFan, JVu, KHong, KLe Brazidec, JYShi, JBiamonte, MBusch, DJLough, REGrecko, RRan, YSensintaffar, JLKamal, ALundgren, KBurrows, FJMansfield, RTimony, GAUlm, EHKasibhatla, SRBoehm, MF 7'-substituted benzothiazolothio- and pyridinothiazolothio-purines as potent heat shock protein 90 inhibitors. J Med Chem 49:5352-62 (2006)  
Target
Name:
Heat shock protein HSP 90-beta
Synonyms:
HS90B_HUMAN HSP 90 HSP90B HSPCB Heat shock protein HSP 90 (Hsp90)
Type:
Molecular Chaperone
Mol. Mass.:
83229.45
Organism:
Homo sapiens (Human)
Description:
P08238
Residue:
724
  
Inhibitor
Name:
BDBM20770
Synonyms:
4-{6-amino-8-[(7-chloro-1,3-benzothiazol-2-yl)sulfanyl]-9H-purin-9-yl}butyl acetate | Benzothiazole analogue, 23
Type:
Small organic molecule
Emp. Form.:
C18H17ClN6O2S2
Mol. Mass.:
448.95
SMILES:
CC(=O)OCCCCn1c(Sc2nc3cccc(Cl)c3s2)nc2c(N)ncnc12
:
Substrate