Target
Acid ceramidase
Ligand
BDBM367194
Substrate
Meas. Tech.
Fluorescent-based In Vitro Assa
IC50
3.00±2 nM
Citation
 Piomelli, DPagliuca, CPizzirani, DBach, ARealini, NDe Vivo, M Benzoxazolone derivatives as acid ceramidase inhibitors, and their use as medicaments US Patent  US10226452 Publication Date 3/12/2019 
Target
Name:
Acid ceramidase
Synonyms:
ASAH ASAH1_HUMAN Acid ceramidase (AC)
Type:
Enzyme
Mol. Mass.:
44662.65
Organism:
Homo sapiens (Human)
Description:
Q13510
Residue:
395
  
Inhibitor
Name:
BDBM367194
Synonyms:
5-nitro-2-oxo-N-(4- phenylbutyl)-1,3- benzoxazole-3-carboxamide | US10226452, Example 11
Type:
Small organic molecule
Emp. Form.:
C18H17N3O5
Mol. Mass.:
355.3447
SMILES:
[O-][N+](=O)c1ccc2oc(=O)n(C(=O)NCCCCc3ccccc3)c2c1
: