Target
Serine/threonine-protein kinase MARK2
Ligand
BDBM247039
Substrate
Meas. Tech.
PAR-1 FLIPR Assay
IC50
11.3±n/a nM
Citation
 Yang, ZZhang, FDong, GKnowles, SLMaletic, M Preparation and use of 7a-amide substituted- 6,6-difluoro bicyclic himbacine derivatives as PAR-1 receptor antagonists US Patent  US9701669 Publication Date 7/11/2017 
Target
Name:
Serine/threonine-protein kinase MARK2
Synonyms:
ELKL motif kinase 1 MAP/microtubule affinity-regulating kinase 2 MARK2_HUMAN Par-1 | Serine/threonine-protein kinase MARK2
Type:
PROTEIN
Mol. Mass.:
87953.09
Organism:
Homo sapiens (Human)
Description:
ChEMBL_774586
Residue:
788
  
Inhibitor
Name:
BDBM247039
Synonyms:
2-((1R,3aR, 6S,7R,7aS)-7- ((E)-2-(5-(2- cyanophenyl) pyridin-2- yl)vinyl)-5,5- difluoro- 1,6-dimethyl-3- oxooctahydro- isobenzofuran- 3a- yl)propanamide US9701669, 8 | US9701669, 9
Type:
Small organic molecule
Emp. Form.:
C27H27F2N3O3
Mol. Mass.:
479.5184
SMILES:
CC(C(N)=O)[C@@]12CC(F)(F)[C@@H](C)[C@H](\C=C\c3ccc(cn3)-c3ccccc3C#N)[C@@H]1[C@@H](C)OC2=O
: