Target
Potassium voltage-gated channel subfamily H member 2
Ligand
BDBM247038
Substrate
Meas. Tech.
MK-499 Filter Binding Assay
pH
7.4±n/a
Temperature
298.15±n/a K
IC50
20400±n/a nM
Comments
extracted
Citation
 Yang, ZZhang, FDong, GKnowles, SLMaletic, M Preparation and use of 7a-amide substituted- 6,6-difluoro bicyclic himbacine derivatives as PAR-1 receptor antagonists US Patent  US9701669 Publication Date 7/11/2017 
Target
Name:
Potassium voltage-gated channel subfamily H member 2
Synonyms:
1,3-beta-glucan synthase component GLS2 ERG Eag-related protein 1 Ether-a-go-go-related gene (HERG) Ether-a-go-go-related gene potassium channel 1 Ether-a-go-go-related gene potassium channel 1 (hERG1) Ether-a-go-go-related protein 1 H-ERG KCNH2 Potassium voltage-gated channel subfamily H member 2 (hERG) Voltage-gated potassium channel subunit Kv11.1 hERG Potassium Channel 1 | putative potassium channel subunit
Type:
Multi-pass membrane protein
Mol. Mass.:
126672.65
Organism:
Homo sapiens (Human)
Description:
Q12809
Residue:
1159
  
Inhibitor
Name:
BDBM247038
Synonyms:
2-((1R,3aR, 6S,7R,7aS)-5,5- difluoro-7- ((E)-2-(5-(3- fluorophenyl) pyridin-2- yl)vinyl)-1,6- dimethyl-3- oxooctahydro- isobenzofuran- 3a-yl)acetamide | US9701669, 6
Type:
Small organic molecule
Emp. Form.:
C25H25F3N2O3
Mol. Mass.:
458.4728
SMILES:
C[C@H]1OC(=O)[C@]2(CC(N)=O)CC(F)(F)[C@@H](C)[C@H](\C=C\c3ccc(cn3)-c3cccc(F)c3)[C@H]12
: