Target
Epidermal growth factor receptor
Ligand
BDBM368386
Substrate
Meas. Tech.
HER2 Exon 20 YVMA Insertion Mutation
IC50
750±n/a nM
Citation
 Huang, WGong, YLi, FBencivenga, NEDalgarno, DCKohlmann, AShakespeare, WCThomas, RMZhu, XWest, AYoungsaye, WZhang, YZhou, T Heteroaryl compounds for kinase inhibition US Patent  US10227342 Publication Date 3/12/2019 
Target
Name:
Epidermal growth factor receptor
Synonyms:
EGF Receptor Substrate EGFR_HUMAN ERBB1 Epidermal Growth Factor Receptor erbB-1 Epidermal growth factor receptor (EGFR) HER1 Proto-oncogene c-ErbB-1 Tyrosine-Protein Kinase ErbB-1
Type:
Receptor Kinase Domain
Mol. Mass.:
134279.59
Organism:
Homo sapiens (Human)
Description:
P00533
Residue:
1210
  
Inhibitor
Name:
BDBM368386
Synonyms:
US10227342, Example 21
Type:
Small organic molecule
Emp. Form.:
C30H31N7O3
Mol. Mass.:
537.6122
SMILES:
COc1ccc(NC(=O)C=C)cc1Nc1ncc(C#N)c(n1)-c1cn(C)c2cc(OCC3CCCN3C)ccc12
: