Target
Epidermal growth factor receptor
Ligand
BDBM368450
Substrate
Meas. Tech.
ASV & NPG EGFR Exon 20 Insertion Mutations
IC50
<100±n/a nM
Citation
 Huang, WGong, YLi, FBencivenga, NEDalgarno, DCKohlmann, AShakespeare, WCThomas, RMZhu, XWest, AYoungsaye, WZhang, YZhou, T Heteroaryl compounds for kinase inhibition US Patent  US10227342 Publication Date 3/12/2019 
Target
Name:
Epidermal growth factor receptor
Synonyms:
EGF Receptor Substrate EGFR_HUMAN ERBB1 Epidermal Growth Factor Receptor erbB-1 Epidermal growth factor receptor (EGFR) HER1 Proto-oncogene c-ErbB-1 Tyrosine-Protein Kinase ErbB-1
Type:
Receptor Kinase Domain
Mol. Mass.:
134279.59
Organism:
Homo sapiens (Human)
Description:
P00533
Residue:
1210
  
Inhibitor
Name:
BDBM368450
Synonyms:
US10227342, Example 81
Type:
Small organic molecule
Emp. Form.:
C30H35N7O4
Mol. Mass.:
557.6434
SMILES:
COC(=O)c1ccc2n(C)cc(-c3ccnc(Nc4cc(NC(=O)C=C)c(cc4OC)N(C)CCN(C)C)n3)c2c1
: