Target
Epidermal growth factor receptor [T790M,L858R]
Ligand
BDBM368455
Substrate
Meas. Tech.
EGFR Exon 21 L858R and Exon 20 T790M Concurrent Mutations
IC50
<100±n/a nM
Citation
 Huang, WGong, YLi, FBencivenga, NEDalgarno, DCKohlmann, AShakespeare, WCThomas, RMZhu, XWest, AYoungsaye, WZhang, YZhou, T Heteroaryl compounds for kinase inhibition US Patent  US10227342 Publication Date 3/12/2019 
Target
Name:
Epidermal growth factor receptor [T790M,L858R]
Synonyms:
EGFR EGFR_HUMAN ERBB1 Epidermal growth factor receptor (EGFR)(T790M/L858R) Epidermal growth factor receptor (T790M, L858R) Epidermal growth factor receptor(L858R, T790M) | HER1
Type:
Mol. Mass.:
134353.72
Organism:
Homo sapiens (Human)
Description:
P00533[T790M,L858R]
Residue:
1210
  
Inhibitor
Name:
BDBM368455
Synonyms:
US10227342, Example 85
Type:
Small organic molecule
Emp. Form.:
C32H39N7O4
Mol. Mass.:
585.6966
SMILES:
COc1cc(N(C)CCN(C)C)c(NC(=O)C=C)cc1Nc1nccc(n1)-c1cn(C)c2c(cccc12)C(=O)OC(C)C
: