Target
Serine/threonine-protein kinase/endoribonuclease IRE1
Ligand
BDBM160434
Substrate
Meas. Tech.
IRE-1alpha Assay
pH
7.5±n/a
Temperature
303.15±n/a K
IC50
<100±n/a nM
EC50
>10000±n/a nM
Comments
extracted
Citation
 Zeng, QToro, APatterson, JBWade, WSZubovics, ZYang, YWu, Z IRE-1α inhibitors US Patent  US9693992 Publication Date 7/4/2017 
Target
Name:
Serine/threonine-protein kinase/endoribonuclease IRE1
Synonyms:
ERN1 Endoplasmic reticulum-to-nucleus signaling 1 IRE1 Inositol requiring enzyme 1 (IRE-1alpha) Inositol-requiring protein 1 Ire1-alpha Serine/threonine-protein kinase/endoribonuclease IRE1 hIRE1p
Type:
Enzyme
Mol. Mass.:
109731.20
Organism:
Homo sapiens (Human)
Description:
O75460
Residue:
977
  
Inhibitor
Name:
BDBM160434
Synonyms:
US9040714, 148 | US9693992, 148
Type:
Small organic molecule
Emp. Form.:
C16H17NO7
Mol. Mass.:
335.3087
SMILES:
COc1cc2c(C)c(CC(=O)NCCO)c(=O)oc2c(C=O)c1O
: