Target
Apoptosis regulator Bcl-2
Ligand
BDBM21445
Substrate
Fluorescein-labeled BAX peptide
Meas. Tech.
Fluorescence Polarization Assay and FL5.12 Cellular Assay
Ki
<1±n/a nM
EC50
27±n/a nM
Citation
 Bruncko, MOost, TKBelli, BADing, HJoseph, MKKunzer, AMartineau, DMcClellan, WJMitten, MNg, SCNimmer, PMOltersdorf, TPark, CMPetros, AMShoemaker, ARSong, XWang, XWendt, MDZhang, HFesik, SWRosenberg, SHElmore, SW Studies leading to potent, dual inhibitors of Bcl-2 and Bcl-xL. J Med Chem 50:641-62 (2007)  
Target
Name:
Apoptosis regulator Bcl-2
Synonyms:
Apoptosis regulator Bcl-2 Protein BCL-2 BCL2_HUMAN | Bcl-2 Protein
Type:
Homodimer or heterodimer
Mol. Mass.:
26269.11
Organism:
Homo sapiens (Human)
Description:
P10415
Residue:
239
  
Inhibitor
Name:
BDBM21445
Synonyms:
4-(4-{[2-(2-chlorophenyl)phenyl]methyl}piperazin-1-yl)-N-[(4-{[(2R)-4-(dimethylamino)-1-(phenylsulfanyl)butan-2-yl]amino}-3-nitrobenzene)sulfonyl]benzamide | N-Benylpiperazine derivative, 23n
Type:
Small organic molecule
Emp. Form.:
C42H45ClN6O5S2
Mol. Mass.:
813.427
SMILES:
CN(C)CC[C@H](CSc1ccccc1)Nc1ccc(cc1[N+]([O-])=O)S(=O)(=O)NC(=O)c1ccc(cc1)N1CCN(Cc2ccccc2-c2ccccc2Cl)CC1
:
Substrate
Name:
Fluorescein-labeled BAX peptide
Synonyms:
Type:
fluorescein-labeled probe
Mol. Mass.:
2800.15
Organism:
Description:
Residue:
25