Target
Transient receptor potential cation channel subfamily V member 1
Ligand
BDBM369801
Substrate
Meas. Tech.
calcium assay
IC50
92.0±n/a nM
Citation
 Napoletano, MTrevisani, MPavani, MGFruttarolo, F TRPV1 vanilloid receptor antagonists with a bicyclic portion US Patent  US10233177 Publication Date 3/19/2019 
Target
Name:
Transient receptor potential cation channel subfamily V member 1
Synonyms:
Capsaicin receptor TRPV1_RAT Trpv1 Vanilloid VR1 Vanilloid receptor 1 (VRI/TRPV1) Vanilloid receptor type 1-like (TrpV1/Vr1) Vr1l | osm-9-like TRP channel 1
Type:
Transient Receptor
Mol. Mass.:
94956.12
Organism:
Rattus norvegicus (rat)
Description:
O35433
Residue:
838
  
Inhibitor
Name:
BDBM369801
Synonyms:
US10233177, Example 69
Type:
Small organic molecule
Emp. Form.:
C17H17F3N6O2
Mol. Mass.:
394.3511
SMILES:
CN(C)c1nc(ccc1CNC(=O)Nc1cccc2[nH]c(=O)[nH]c12)C(F)(F)F
: