Target
Lysine-specific histone demethylase 1A
Ligand
BDBM261746
Substrate
Meas. Tech.
Monoamine Oxidase Assays for Determining the Selectivity of the Compounds of the Invention for LSD1
Ki
550±n/a nM
Citation
 Ortega Muñoz, AFyfe, MCMartinell Pedemonte, MTirapu Fernandez De La Cuesta, IEstiarte Martinez, M Arylcyclopropylamine based demethylase inhibitors of LSD1 and their medical use US Patent  US10233178 Publication Date 3/19/2019 
Target
Name:
Lysine-specific histone demethylase 1A
Synonyms:
AOF2 Flavin-containing amine oxidase domain-containing protein 2 KDM1A KIAA0601 Lysine-specific demethylase 1 (LSD1) Lysine-specific histone demethylase 1 (LSD1)
Type:
Enzyme
Mol. Mass.:
92901.01
Organism:
Homo sapiens (Human)
Description:
O60341
Residue:
852
  
Inhibitor
Name:
BDBM261746
Synonyms:
US10233178, Example 13 | US9708309, 13
Type:
Small organic molecule
Emp. Form.:
C19H18F2N4O2
Mol. Mass.:
372.3686
SMILES:
Nc1nnc(CN[C@H]2C[C@@H]2c2ccc(OCc3cc(F)cc(F)c3)cc2)o1
: