Target
Angiotensin-converting enzyme
Ligand
BDBM21652
Substrate
BDBM21660
Meas. Tech.
In Vitro Inhibition of NEP
Ki
41±n/a nM
Citation
 Inguimbert, NCoric, PPoras, HMeudal, HTeffot, FFournié-Zaluski, MCRoques, BP Toward an optimal joint recognition of the S1' subsites of endothelin converting enzyme-1 (ECE-1), angiotensin converting enzyme (ACE), and neutral endopeptidase (NEP). J Med Chem 45:1477-86 (2002)  
Target
Name:
Angiotensin-converting enzyme
Synonyms:
ACE_RAT Angiotensin-converting enzyme | Dcp1
Type:
PROTEIN
Mol. Mass.:
150907.81
Organism:
Rattus norvegicus
Description:
ChEMBL_35219
Residue:
1313
  
Inhibitor
Name:
BDBM21652
Synonyms:
(2S)-2-[(2S)-2-[(1S)-2,3-dihydro-1H-inden-1-yl]-3-sulfanylpropanamido]-3-(1H-indol-3-yl)propanoic acid | Mercaptoacyl amino acid compound, 13a
Type:
Small organic molecule
Emp. Form.:
C23H24N2O3S
Mol. Mass.:
408.513
SMILES:
OC(=O)[C@H](Cc1c[nH]c2ccccc12)NC(=O)[C@@H](CS)[C@@H]1CCc2ccccc12
:
Substrate
Name:
BDBM21660
Synonyms:
N-Cbz-Phe-His-Leu
Type:
Emp. Form.:
Mol. Mass.:
SMILES:
: