Target
Cyclin-dependent kinase 6/G1/S-specific cyclin-D1
Ligand
BDBM370117
Substrate
Meas. Tech.
CDK6/Cyclin D1 Mobility Shift Assay
Ki
3.84±n/a nM
Citation
 Freeman-Cook, KDHoffman, RLNagata, ANinkovic, S CDK2/4/6 inhibitors US Patent  US10233188 Publication Date 3/19/2019 
Target
Name:
Cyclin-dependent kinase 6/G1/S-specific cyclin-D1
Synonyms:
CDK6/Cyclin D1
Type:
Enzyme
Mol. Mass.:
Description:
Components:
This complex has 2 components.
Component 1
Name:
Cyclin-dependent kinase 6
Synonyms:
CDK6 CDKN6 Cyclin-dependent kinase 6 (CDK 6) | Serine/threonine-protein kinase PLSTIRE
Type:
Enzyme Subunit
Mol. Mass.:
36937.42
Organism:
Homo sapiens (Human)
Description:
Q00534
Residue:
326
  
Component 2
Name:
G1/S-specific cyclin-D1
Synonyms:
CCND1_MOUSE Cyclin D1 | Cyl-1
Type:
Enzyme Subunit
Mol. Mass.:
33418.84
Organism:
Mus musculus (mouse)
Description:
Residue:
295
  
Inhibitor
Name:
BDBM370117
Synonyms:
US10233188, Example 124 US10800783, Example 124 | US11396512, Example 124
Type:
Small organic molecule
Emp. Form.:
C19H27FN6O4S
Mol. Mass.:
454.519
SMILES:
CNS(=O)(=O)N1CCC(CC1)Nc1ncc2cc(F)c(=O)n([C@@H]3CCC[C@@]3(C)O)c2n1
: