Target
Peroxisome proliferator-activated receptor delta
Ligand
BDBM21762
Substrate
TRAP220
Meas. Tech.
PPAR FRET Assay
Temperature
298.15±n/a K
EC50
67±n/a nM
Comments
extracted
Citation
 Rudolph, JChen, LMajumdar, DBullock, WHBurns, MClaus, TDela Cruz, FEDaly, MEhrgott, FJJohnson, JSLivingston, JNSchoenleber, RWShapiro, JYang, LTsutsumi, MMa, X Indanylacetic acid derivatives carrying 4-thiazolyl-phenoxy tail groups, a new class of potent PPAR alpha/gamma/delta pan agonists: synthesis, structure-activity relationship, and in vivo efficacy. J Med Chem 50:984-1000 (2007)  
Target
Name:
Peroxisome proliferator-activated receptor delta
Synonyms:
NR1C2 NUCI Nuclear receptor subfamily 1 group C member 2 PPAR-beta PPARD Peroxisome proliferator-activated receptor Peroxisome proliferator-activated receptor delta
Type:
Enzyme
Mol. Mass.:
49910.45
Organism:
Homo sapiens (Human)
Description:
Q03181
Residue:
441
  
Inhibitor
Name:
BDBM21762
Synonyms:
2-[(1S)-5-[3-(3,4-dimethylphenoxy)propoxy]-2,3-dihydro-1H-inden-1-yl]acetic acid | Indanylacetic Acid Analog, 17j
Type:
Small organic molecule
Emp. Form.:
C22H26O4
Mol. Mass.:
354.4394
SMILES:
Cc1ccc(OCCCOc2ccc3[C@H](CC(O)=O)CCc3c2)cc1C
:
Substrate
Name:
TRAP220
Synonyms:
ARC205 CRSP200 DRIP230 MED1_HUMAN PBP PPARGBP RB18A TRIP2 | Thyroid hormone receptor-associated protein complex 220 kDa component
Type:
Transcription Coactivator
Mol. Mass.:
168519.50
Organism:
Homo sapiens (Human)
Description:
Residue:
1581