Target
Peroxisome proliferator-activated receptor gamma
Ligand
BDBM21762
Substrate
BDBM10852
Meas. Tech.
PPAR FRET Assay
Temperature
298.15±n/a K
EC50
>10000±n/a nM
Comments
extracted
Citation
 Rudolph, JChen, LMajumdar, DBullock, WHBurns, MClaus, TDela Cruz, FEDaly, MEhrgott, FJJohnson, JSLivingston, JNSchoenleber, RWShapiro, JYang, LTsutsumi, MMa, X Indanylacetic acid derivatives carrying 4-thiazolyl-phenoxy tail groups, a new class of potent PPAR alpha/gamma/delta pan agonists: synthesis, structure-activity relationship, and in vivo efficacy. J Med Chem 50:984-1000 (2007)  
Target
Name:
Peroxisome proliferator-activated receptor gamma
Synonyms:
NR1C3 PPAR-gamma PPARG_HUMAN Peroxisome proliferator-activated receptor gamma (PPAR gamma) Peroxisome proliferator-activated receptor gamma (PPARĪ³) peroxisome proliferator-activated receptor gamma isoform 2
Type:
Nuclear Receptor
Mol. Mass.:
57613.46
Organism:
Homo sapiens (Human)
Description:
P37231
Residue:
505
  
Inhibitor
Name:
BDBM21762
Synonyms:
2-[(1S)-5-[3-(3,4-dimethylphenoxy)propoxy]-2,3-dihydro-1H-inden-1-yl]acetic acid | Indanylacetic Acid Analog, 17j
Type:
Small organic molecule
Emp. Form.:
C22H26O4
Mol. Mass.:
354.4394
SMILES:
Cc1ccc(OCCCOc2ccc3[C@H](CC(O)=O)CCc3c2)cc1C
:
Substrate