Target
Orexin receptor type 2
Ligand
BDBM370826
Substrate
Meas. Tech.
FLIPR Ca2+ Flux Assay
IC50
76.0±n/a nM
Citation
 Kuduk, SDLiverton, NLuo, Y Heteroaryl orexin receptor antagonists US Patent  US10239838 Publication Date 3/26/2019 
Target
Name:
Orexin receptor type 2
Synonyms:
HCRTR2 OX2R_HUMAN Orexin receptor type 2 (OR-2) Orexin receptor type 2 (OX2R) Ox-2-R | Ox2-R
Type:
Protein
Mol. Mass.:
50710.53
Organism:
Homo sapiens (Human)
Description:
O43614
Residue:
444
  
Inhibitor
Name:
BDBM370826
Synonyms:
2-ethoxy-N-ethyl-N-{2-[6-(1- hydroxy-1-methylethyl)pyridin-2- yl]ethyl}benzamide | US10239838, Example 11
Type:
Small organic molecule
Emp. Form.:
C21H28N2O3
Mol. Mass.:
356.4586
SMILES:
CCOc1ccccc1C(=O)N(CC)CCc1cccc(n1)C(C)(C)O
: