Target
Poly(ADP-ribose) glycohydrolase
Ligand
BDBM371293
Substrate
Meas. Tech.
PARG Assay
IC50
27.0±n/a nM
Citation
 McGonagle, AEJordan, AWaszkowycz, BHutton, CWaddell, IHitchin, JRSmith, KMHamilton, NM 2,4-dioxo-quinazoline-6-sulfonamide derivatives as inhibitors of PARG US Patent  US10239843 Publication Date 3/26/2019 
Target
Name:
Poly(ADP-ribose) glycohydrolase
Synonyms:
PARG Poly(ADP-ribose) glycohydrolase | poly(ADP-ribose) glycohydrolase (PARG)
Type:
Protein
Mol. Mass.:
111107.13
Organism:
Homo sapiens (Human)
Description:
Q86W56
Residue:
976
  
Inhibitor
Name:
BDBM371293
Synonyms:
N-(1-Cyanocyclopropyl)-1-[(3-methylisoxazol-5-yl)methyl]-3-[(2-methylthiazol-5-yl)methyl]-2,4-dioxo-quinazoline-6-sulfonamide | US10239843, Example 400
Type:
Small organic molecule
Emp. Form.:
C22H20N6O6S
Mol. Mass.:
496.496
SMILES:
Cc1cc(Cn2c3ccc(cc3c(=O)n(Cc3cnc(C)o3)c2=O)S(=O)(=O)NC2(CC2)C#N)on1
: