Target
D(2) dopamine receptor
Ligand
BDBM50192447
Substrate
Meas. Tech.
3H]-Spiperone Binding Assay
Ki
63.1±n/a nM
Citation
 Cremonesi, SMicheli, FSemerano, TTarsi, L Dopamine D3 receptor antagonists US Patent  US10239870 Publication Date 3/26/2019 
Target
Name:
D(2) dopamine receptor
Synonyms:
D2(Short) | Dopamine D2 S receptor
Type:
Mol. Mass.:
47370.77
Organism:
Homo sapiens (Human)
Description:
P14416-2
Residue:
414
  
Inhibitor
Name:
BDBM50192447
Synonyms:
CHEMBL3975989 | US10239870, Example 53
Type:
Small organic molecule
Emp. Form.:
C23H26F3N5OS
Mol. Mass.:
477.546
SMILES:
Cc1ncoc1-c1nnc(SCCCN2CC[C@@]3(C[C@@H]3c3ccccc3C(F)(F)F)C2)n1C
: