Target
D(2) dopamine receptor
Ligand
BDBM50192099
Substrate
Meas. Tech.
3H]-Spiperone Binding Assay
Ki
427±n/a nM
Citation
 Cremonesi, SMicheli, FSemerano, TTarsi, L Dopamine D3 receptor antagonists US Patent  US10239870 Publication Date 3/26/2019 
Target
Name:
D(2) dopamine receptor
Synonyms:
D2(Short) | Dopamine D2 S receptor
Type:
Mol. Mass.:
47370.77
Organism:
Homo sapiens (Human)
Description:
P14416-2
Residue:
414
  
Inhibitor
Name:
BDBM50192099
Synonyms:
CHEMBL3914556 | US10239870, Example 244
Type:
Small organic molecule
Emp. Form.:
C22H24F3N5S2
Mol. Mass.:
479.585
SMILES:
Cn1c(SCCCN2CC[C@]3(C[C@@H]3c3ccc(cc3)C(F)(F)F)C2)nnc1-c1nccs1
: