Target
D(2) dopamine receptor
Ligand
BDBM50192233
Substrate
Meas. Tech.
3H]-Spiperone Binding Assay
Ki
39.8±n/a nM
Citation
 Cremonesi, SMicheli, FSemerano, TTarsi, L Dopamine D3 receptor antagonists US Patent  US10239870 Publication Date 3/26/2019 
Target
Name:
D(2) dopamine receptor
Synonyms:
D2(Short) | Dopamine D2 S receptor
Type:
Mol. Mass.:
47370.77
Organism:
Homo sapiens (Human)
Description:
P14416-2
Residue:
414
  
Inhibitor
Name:
BDBM50192233
Synonyms:
CHEMBL3890178 | US10239870, Example 290
Type:
Small organic molecule
Emp. Form.:
C26H28F3N5OS
Mol. Mass.:
515.594
SMILES:
Cn1c(SCCCN2CC[C@]3(C[C@@H]3c3ccc(cc3)C(F)(F)F)C2)nnc1-c1ccccc1C(N)=O
: