Target
Interleukin-17F
Ligand
BDBM261508
Substrate
Meas. Tech.
TH17 Cytokine Inhibition ELISA
IC50
<10000±n/a nM
Citation
 Gaweco, ATilley, JWWalker, JPalmer, SBlinn, J ROR modulators and their uses US Patent  US9708268 Publication Date 7/18/2017 
Target
Name:
Interleukin-17F
Synonyms:
Cytokine ML-1 IL17F_HUMAN | il-17f
Type:
Enzyme Catalytic Domain
Mol. Mass.:
18053.35
Organism:
Homo sapiens (Human)
Description:
Q96PD4
Residue:
163
  
Inhibitor
Name:
BDBM261508
Synonyms:
1-(4-(1,1,1,3,3,3-hexafluoro-2-hydroxypropan-2-yl)benzyl)indoline-5-carboxamide | US9708268, 11
Type:
Small organic molecule
Emp. Form.:
C8H8BrN
Mol. Mass.:
198.06
SMILES:
Brc1ccc2NCCc2c1
: