Target
RAF proto-oncogene serine/threonine-protein kinase [1-324]
Ligand
BDBM202846
Substrate
Meas. Tech.
In Vitro Raf Activity
IC50
1.29±n/a nM
Citation
 Aversa, RJBarsanti, PABurger, MTDillon, MPDipesa, AHu, CLou, YNishiguchi, GAPan, YPolyakov, VRRamurthy, SRico, ACSetti, LQSmith, ASubramanian, STaft, BRTanner, HRWan, LYusuff, N Biaryl amide compounds as kinase inhibitors US Patent  US10245267 Publication Date 4/2/2019 
Target
Name:
RAF proto-oncogene serine/threonine-protein kinase [1-324]
Synonyms:
C-Raf TR RAF RAF1 | RAF1_HUMAN
Type:
Enzyme Catalytic Domain
Mol. Mass.:
42815.85
Organism:
Homo sapiens (Human)
Description:
P04049 (aa 1-324)
Residue:
384
  
Inhibitor
Name:
BDBM202846
Synonyms:
US10245267, Example 199 US9242969, 199 | US9694016, 199
Type:
Small organic molecule
Emp. Form.:
C22H20F3N3O2S
Mol. Mass.:
447.473
SMILES:
Cc1ccc(NC(=O)c2cccc(c2)C(F)(F)F)cc1-c1csc(n1)N1CCOCC1
: