Target
Serine/threonine-protein kinase B-raf [V600E]
Ligand
BDBM81352
Substrate
Meas. Tech.
In Vitro Raf Activity
IC50
3.00±n/a nM
Citation
 Aversa, RJBarsanti, PABurger, MTDillon, MPDipesa, AHu, CLou, YNishiguchi, GAPan, YPolyakov, VRRamurthy, SRico, ACSetti, LQSmith, ASubramanian, STaft, BRTanner, HRWan, LYusuff, N Biaryl amide compounds as kinase inhibitors US Patent  US10245267 Publication Date 4/2/2019 
Target
Name:
Serine/threonine-protein kinase B-raf [V600E]
Synonyms:
B-RAF V600E B-Raf Protein Kinase Mutant (V600E) BRAF BRAF mutant V600E BRAF_HUMAN Protein mono-ADP-ribosyltransferase (PARP3) RAFB1 Serine/threonine-protein kinase B-raf (V600E) V-RAF murine sarcoma viral oncogene homologue B1 mutant (BRAF V600E)
Type:
Mol. Mass.:
84474.98
Organism:
Homo sapiens (Human)
Description:
P15056 V600E
Residue:
766
  
Inhibitor
Name:
BDBM81352
Synonyms:
US10245267, Example 555 US9694016, 552 | US9694016, 555
Type:
Small organic molecule
Emp. Form.:
C25H28FN5O3
Mol. Mass.:
465.5199
SMILES:
COc1nnc(cc1N1CCOCC1)-c1cc(NC(=O)c2ccnc(c2)C(C)(C)F)ccc1C
: