Target
RAF proto-oncogene serine/threonine-protein kinase [Y340D,Y341D]
Ligand
BDBM372962
Substrate
Meas. Tech.
Time-Resolved Fluorescence Energy Transfer Assay
IC50
5.50±n/a nM
Citation
 Zhou, CWang, SZhang, G Fused tricyclic compounds as Raf kinase inhibitors US Patent  US9895376 Publication Date 2/20/2018 
Target
Name:
RAF proto-oncogene serine/threonine-protein kinase [Y340D,Y341D]
Synonyms:
C-RAF (Y340D Y341D) RAF proto-oncogene serine/threonine-protein kinase (Y340D/Y341D) RAF1 | RAF1_HUMAN
Type:
Serine/threonine-protein kinase
Mol. Mass.:
72984.33
Organism:
Homo sapiens (Human)
Description:
P04049 Y340D Y341D
Residue:
648
  
Inhibitor
Name:
BDBM372962
Synonyms:
US9895376, Compound 1.3
Type:
Small organic molecule
Emp. Form.:
C25H21N3O3S
Mol. Mass.:
443.518
SMILES:
Sc1ccccc1NC(=O)C1C2Cc3ccc(Oc4ccnc5NC(=O)CCc45)cc3C12
: