Target
RAF proto-oncogene serine/threonine-protein kinase [Y340D,Y341D]
Ligand
BDBM372974
Substrate
Meas. Tech.
Time-Resolved Fluorescence Energy Transfer Assay
IC50
4.00±n/a nM
Citation
 Zhou, CWang, SZhang, G Fused tricyclic compounds as Raf kinase inhibitors US Patent  US9895376 Publication Date 2/20/2018 
Target
Name:
RAF proto-oncogene serine/threonine-protein kinase [Y340D,Y341D]
Synonyms:
C-RAF (Y340D Y341D) RAF proto-oncogene serine/threonine-protein kinase (Y340D/Y341D) RAF1 | RAF1_HUMAN
Type:
Serine/threonine-protein kinase
Mol. Mass.:
72984.33
Organism:
Homo sapiens (Human)
Description:
P04049 Y340D Y341D
Residue:
648
  
Inhibitor
Name:
BDBM372974
Synonyms:
US10576087, Compound 2.3a | US9895376, Compound 2.3b
Type:
Small organic molecule
Emp. Form.:
C24H16Cl2N4O3
Mol. Mass.:
479.315
SMILES:
Clc1cc2nc([nH]c2cc1Cl)[C@@H]1[C@H]2Oc3ccc(Oc4ccnc5NC(=O)CCc45)cc3[C@@H]12
: